{"text_format":"1","workbook":"xlsx","n_sheets":2,"sheets":["Árlista"," "],"not_rendered":{"charts":0,"images":0,"macros":1,"external_links":0,"defined_names":5,"comments":0,"pivot_tables":0},"unopened":[],"bounds":{"document_bytes":16777216,"sheet_cells":100000,"rows_first":2000,"rows_last":500,"rows_between":2000,"halvings":0,"cell_chars":16384,"cell_head_chars":4096},"cells_cut":0,"cells_raw":0,"read":"whole","date_system":"1900"}

{"sheet":"Árlista","index":0,"n_rows":1636,"n_cols":12,"rows_kept":1636,"cut":false,"hidden":false,"merged":[[234,1,234,6],[7,1,7,6],[8,1,8,6],[47,1,47,6],[69,1,69,6],[87,1,87,6],[105,1,105,6],[133,1,133,6],[165,1,165,6],[166,1,166,6],[209,1,209,6],[222,1,222,6],[858,1,858,6],[235,1,235,6],[283,1,283,6],[474,1,474,6],[496,1,496,6],[536,1,536,6],[550,1,550,6],[583,1,583,6],[616,1,616,6],[710,1,710,6],[719,1,719,6],[735,1,735,6],[1187,1,1187,6],[1240,1,1240,6],[1362,1,1362,6],[1425,1,1425,6],[895,1,895,6],[942,1,942,6],[1056,1,1056,6],[1073,1,1073,6],[1097,1,1097,6],[1116,1,1116,6],[1613,1,1613,6],[218,3,218,5],[226,3,226,5],[347,3,347,5],[228,3,228,5],[586,3,586,5],[1426,1,1426,6],[1440,1,1440,6],[1465,1,1465,6],[1505,1,1505,6],[1543,1,1543,6],[1612,1,1612,6],[1218,3,1218,5],[1159,1,1159,6],[1,6,1,8],[1,9,1,11],[4,0,4,11],[0,0,0,3],[0,4,0,5],[0,6,0,8],[0,9,0,11],[1,0,1,3],[1,4,1,5],[2,0,2,5],[2,6,2,8],[2,9,2,11],[3,0,3,5],[3,6,3,8],[3,9,3,11]]}
["Megrendelő Neve:"]
["Elszállítás Dátuma:",null,null,null,null,null,"Vásárlás Nettó Értéke:",null,null,{"$f":"SUM(L11:L1636)","v":0}]
["Az árváltoztatás jogát fenntartjuk! Rendelését elküldheti e-mailben a",null,null,null,null,null,"rendeles@irritrade.hu",null,null,"címre."]
["A termékekről bővebben a ",null,null,null,null,null,"www.irritrade.hu",null,null,"oldalon vagy a termék nevére kattintva olvashat."]
["Szűrési Lehetőségek"]
["ÚJ",null,"Termékkategória",null,"Gyártó","Megnevezés","Nettó ár","Mennyiség","Egység","Csom. Egy.","Rendelésre","Nettó Ár Összesen"]
[]
[null,"VEZÉRLŐ AUTOMATIKÁK ÖNTÖZŐRENDSZEREKHEZ"]
[null,"HÁLÓZATI (230V-OS) VEZÉRLŐK"]
[]
[null,null,"HÁLÓZATI VEZÉRLŐ","ELC401IE","HUNTER","ECO LOGIC, 4 zónás vezérlő, BELTÉRI",{"$f":"VLOOKUP(D11,' '!$1:$1048576,3,0)","v":14170},null,"db",8,null,{"$f":"G11*H11","v":0}]
[null,null,"HÁLÓZATI VEZÉRLŐ","ELC601IE","HUNTER","ECO LOGIC, 6 zónás vezérlő, BELTÉRI",{"$f":"VLOOKUP(D12,' '!$1:$1048576,3,0)","v":16094},null,"db",8,null,{"$f":"G12*H12","v":0}]
[]
[null,null,"HÁLÓZATI VEZÉRLŐ","XC-401-iE","HUNTER","X-CORE, 4 zónás vezérlő, BELTÉRI",{"$f":"VLOOKUP(D14,' '!$1:$1048576,3,0)","v":23970},null,"db",10,null,{"$f":"G14*H14","v":0}]
[null,null,"HÁLÓZATI VEZÉRLŐ","XC-601-iE","HUNTER","X-CORE, 6 zónás vezérlő, BELTÉRI",{"$f":"VLOOKUP(D15,' '!$1:$1048576,3,0)","v":26963},null,"db",10,null,{"$f":"G15*H15","v":0}]
[null,null,"HÁLÓZATI VEZÉRLŐ","XC-801-iE","HUNTER","X-CORE, 8 zónás vezérlő, BELTÉRI",{"$f":"VLOOKUP(D16,' '!$1:$1048576,3,0)","v":34456},null,"db",10,null,{"$f":"G16*H16","v":0}]
[]
[null,null,"HÁLÓZATI VEZÉRLŐ","XC-401-E","HUNTER","X-CORE, 4 zónás vezérlő, KÜLTÉRI",{"$f":"VLOOKUP(D18,' '!$1:$1048576,3,0)","v":34848},null,"db",10,null,{"$f":"G18*H18","v":0}]
[null,null,"HÁLÓZATI VEZÉRLŐ","XC-601-E","HUNTER","X-CORE, 6 zónás vezérlő, KÜLTÉRI",{"$f":"VLOOKUP(D19,' '!$1:$1048576,3,0)","v":40527},null,"db",10,null,{"$f":"G19*H19","v":0}]
[null,null,"HÁLÓZATI VEZÉRLŐ","XC-801-E","HUNTER","X-CORE, 8 zónás vezérlő, KÜLTÉRI",{"$f":"VLOOKUP(D20,' '!$1:$1048576,3,0)","v":48950},null,"db",10,null,{"$f":"G20*H20","v":0}]
[]
[null,null,"HÁLÓZATI VEZÉRLŐ","PC-401i-E","HUNTER","PRO-C moduláris vezérlő, 4-16 zónáig, BELTÉRI",{"$f":"VLOOKUP(D22,' '!$1:$1048576,3,0)","v":43454},null,"db",8,null,{"$f":"G22*H22","v":0}]
[null,null,"HÁLÓZATI VEZÉRLŐ","PC-401-E","HUNTER","PRO-C moduláris vezérlő, 4-16 zónáig, KÜLTÉRI",{"$f":"VLOOKUP(D23,' '!$1:$1048576,3,0)","v":56522},null,"db",8,null,{"$f":"G23*H23","v":0}]
[]
[null,null,"HÁLÓZATI VEZÉRLŐ","PCC601E","HUNTER","PRO-C CONVENTIONAL 6 zónás FIX vezérlő, KÜLTÉRI",{"$f":"G19","v":40527},null,"db",8,"Rendelésre!",{"$f":"G25*H25","v":0}]
[null,null,"HÁLÓZATI VEZÉRLŐ","PCC1201E","HUNTER","PRO-C CONVENTIONAL 12 zónás FIX vezérlő, KÜLTÉRI",{"$f":"VLOOKUP(D26,' '!$1:$1048576,3,0)","v":91032},null,"db",8,"Rendelésre!",{"$f":"G26*H26","v":0}]
[]
[null,null,"HÁLÓZATI VEZÉRLŐ","IC600PL","HUNTER","I-CORE moduláris vezérlő, 6-30 zónáig, MŰANYAG HÁZAS",{"$f":"VLOOKUP(D28,' '!$1:$1048576,3,0)","v":129900},null,"db",1,"Rendelésre!",{"$f":"G28*H28","v":0}]
[null,null,"HÁLÓZATI VEZÉRLŐ","IC600M","HUNTER","I-CORE moduláris vezérlő, 6-42 zónáig, FÉMHÁZAS",{"$f":"VLOOKUP(D29,' '!$1:$1048576,3,0)","v":258030},null,"db",1,"Rendelésre!",{"$f":"G29*H29","v":0}]
[]
[null,null,"HÁLÓZATI VEZÉRLŐ","F44082","RAIN BIRD","ESP-LXME 8 moduláris vezérlő, 8-48 zónáig, MŰANYAG HÁZAS",{"$f":"VLOOKUP(D31,' '!$1:$1048576,3,0)","v":119594},null,"db",1,"Rendelésre!",{"$f":"G31*H31","v":0}]
[null,null,"HÁLÓZATI VEZÉRLŐ","F44122","RAIN BIRD","ESP-LXME 12 moduláris vezérlő, 12-48 zónáig, MŰANYAG HÁZAS",{"$f":"VLOOKUP(D32,' '!$1:$1048576,3,0)","v":191243},null,"db",1,"Rendelésre!",{"$f":"G32*H32","v":0}]
[]
["ÚJ",null,"HÁLÓZATI VEZÉRLŐ","200.4180410","RAIN","C-Dial, 4 zónás vezérlő, BELTÉRI",{"$f":"VLOOKUP(D34,' '!$1:$1048576,3,0)","v":11863},null,"db",1,null,{"$f":"G34*H34","v":0}]
["ÚJ",null,"HÁLÓZATI VEZÉRLŐ","200.4180610","RAIN","C-Dial, 6 zónás vezérlő, BELTÉRI",{"$f":"VLOOKUP(D35,' '!$1:$1048576,3,0)","v":13486},null,"db",1,null,{"$f":"G35*H35","v":0}]
[]
["ÚJ",null,"HÁLÓZATI VEZÉRLŐ","200.4080410","RAIN","I-Dial, 4 zónás vezérlő, BELTÉRI",{"$f":"VLOOKUP(D37,' '!$1:$1048576,3,0)","v":18622},null,"db",1,null,{"$f":"G37*H37","v":0}]
["ÚJ",null,"HÁLÓZATI VEZÉRLŐ","200.4080610","RAIN","I-Dial, 6 zónás vezérlő, BELTÉRI",{"$f":"VLOOKUP(D38,' '!$1:$1048576,3,0)","v":20676},null,"db",1,null,{"$f":"G38*H38","v":0}]
["ÚJ",null,"HÁLÓZATI VEZÉRLŐ","200.4080810","RAIN","I-Dial, 8 zónás vezérlő, BELTÉRI",{"$f":"VLOOKUP(D39,' '!$1:$1048576,3,0)","v":25959},null,"db",1,null,{"$f":"G39*H39","v":0}]
[]
["ÚJ",null,"HÁLÓZATI VEZÉRLŐ","200.4083410","RAIN","I-Dial, 4 zónás vezérlő, KÜLTÉRI",{"$f":"VLOOKUP(D41,' '!$1:$1048576,3,0)","v":27181},null,"db",1,null,{"$f":"G41*H41","v":0}]
["ÚJ",null,"HÁLÓZATI VEZÉRLŐ","200.4083610","RAIN","I-Dial, 6 zónás vezérlő, KÜLTÉRI",{"$f":"VLOOKUP(D42,' '!$1:$1048576,3,0)","v":29872},null,"db",1,null,{"$f":"G42*H42","v":0}]
["ÚJ",null,"HÁLÓZATI VEZÉRLŐ","200.4083810","RAIN","I-Dial, 8 zónás vezérlő, KÜLTÉRI",{"$f":"VLOOKUP(D43,' '!$1:$1048576,3,0)","v":37453},null,"db",1,null,{"$f":"G43*H43","v":0}]
[]
[null,null,"HÁLÓZATI VEZÉRLŐ","TMC-212ID","TORO","TMC-212 vezérlő, 4-12 zónáig bővíthető, BELTÉRI",{"$f":"VLOOKUP(D45,' '!$1:$1048576,3,0)","v":44920},null,"db",1,"Rendelésre!",{"$f":"G45*H45","v":0}]
[null,null,"HÁLÓZATI VEZÉRLŐ","TMC-212OD","TORO","TMC-212 vezérlő, 4-12 zónáig bővíthető, KÜLTÉRI",{"$f":"VLOOKUP(D46,' '!$1:$1048576,3,0)","v":71991},null,"db",1,"Rendelésre!",{"$f":"G46*H46","v":0}]
[]
[null,"TÁVOLI ELÉRÉSŰ, WIFI KÉPES VEZÉRLŐK"]
[]
["ÚJ",null,"WIFI KÉPES VEZÉRLŐ","HC-601i-E","HUNTER","HC, BELTÉRI, 6 zónás vezérlő, Wi-Fi képes",{"$f":"VLOOKUP(D50,' '!$1:$1048576,3,0)","v":72352},null,"db",1,null,{"$f":"G50*H50","v":0}]
["ÚJ",null,"WIFI KÉPES VEZÉRLŐ","HC-1201i-E","HUNTER","HC, BELTÉRI, 12 zónás vezérlő, Wi-Fi képes",{"$f":"VLOOKUP(D51,' '!$1:$1048576,3,0)","v":84281},null,"db",1,null,{"$f":"G51*H51","v":0}]
["ÚJ",null,"WIFI KÉPES VEZÉRLŐ","HC-1200M","HUNTER","HC, 12 zónás bővítő modul",{"$f":"VLOOKUP(D52,' '!$1:$1048576,3,0)","v":45383},null,"db",1,null,{"$f":"G52*H52","v":0}]
[]
["ÚJ",null,"WIFI KÉPES VEZÉRLŐ","PHC-601E","HUNTER","PRO-HC, KÜLTÉRI, 6 zónás Wi-Fi képes vezérlő",{"$f":"VLOOKUP(D54,' '!$1:$1048576,3,0)","v":84281},null,"db",1,null,{"$f":"G54*H54","v":0}]
["ÚJ",null,"WIFI KÉPES VEZÉRLŐ","PHC-1201E","HUNTER","PRO-HC, KÜLTÉRI, 12 zónás Wi-Fi képes vezérlő",{"$f":"VLOOKUP(D55,' '!$1:$1048576,3,0)","v":103470},null,"db",1,null,{"$f":"G55*H55","v":0}]
["ÚJ",null,"WIFI KÉPES VEZÉRLŐ","PHC-2401E","HUNTER","PRO-HC, KÜLTÉRI, 24 zónás Wi-Fi képes vezérlő",{"$f":"VLOOKUP(D56,' '!$1:$1048576,3,0)","v":181267},null,"db",1,"Rendelésre!",{"$f":"G56*H56","v":0}]
[]
["ÚJ",null,"WIFI KÉPES VEZÉRLŐ","HCPLANENTHUSIAST","HUNTER","HC, kiterjesztett előfizetés kártya 1 évre",{"$f":"VLOOKUP(D58,' '!$1:$1048576,3,0)","v":15239},null,"db",1,"Rendelésre!",{"$f":"G58*H58","v":0}]
[]
["ÚJ",null,"WIFI KÉPES VEZÉRLŐ","RZXe4i","RAIN BIRD","ESP-RZX, 6 zónás vezérlő, BELTÉRI, LNK ready",{"$f":"VLOOKUP(D60,' '!$1:$1048576,3,0)","v":23388},null,"db",1,null,{"$f":"G60*H60","v":0}]
["ÚJ",null,"WIFI KÉPES VEZÉRLŐ","RZXe6i","RAIN BIRD","ESP-RZX, 6 zónás vezérlő, BELTÉRI, LNK ready",{"$f":"VLOOKUP(D61,' '!$1:$1048576,3,0)","v":25562},null,"db",1,null,{"$f":"G61*H61","v":0}]
["ÚJ",null,"WIFI KÉPES VEZÉRLŐ","RZXe8i","RAIN BIRD","ESP-RZX, 8 zónás vezérlő, BELTÉRI, LNK ready",{"$f":"VLOOKUP(D62,' '!$1:$1048576,3,0)","v":30866},null,"db",1,null,{"$f":"G62*H62","v":0}]
[]
["ÚJ",null,"WIFI KÉPES VEZÉRLŐ","RZXe4","RAIN BIRD","ESP-RZX, 4 zónás vezérlő, KÜLTÉRI, LNK ready",{"$f":"VLOOKUP(D64,' '!$1:$1048576,3,0)","v":33032},null,"db",1,null,{"$f":"G64*H64","v":0}]
["ÚJ",null,"WIFI KÉPES VEZÉRLŐ","RZXe6","RAIN BIRD","ESP-RZX, 6 zónás vezérlő, KÜLTÉRI, LNK ready",{"$f":"VLOOKUP(D65,' '!$1:$1048576,3,0)","v":37841},null,"db",1,null,{"$f":"G65*H65","v":0}]
["ÚJ",null,"WIFI KÉPES VEZÉRLŐ","RZXe8","RAIN BIRD","ESP-RZX, 8 zónás vezérlő, KÜLTÉRI, LNK ready",{"$f":"VLOOKUP(D66,' '!$1:$1048576,3,0)","v":49854},null,"db",1,null,{"$f":"G66*H66","v":0}]
[]
["ÚJ",null,"WIFI KÉPES VEZÉRLŐ","ESP4MEWIFI","RAIN BIRD","ESP-Me moduláris vezérlő, 4-22 zónáig, KÜLTÉRI, LNK ready",{"$f":"VLOOKUP(D68,' '!$1:$1048576,3,0)","v":62288},null,"db",1,null,{"$f":"G68*H68","v":0}]
[]
[null,"ELEMES VEZÉRLŐK"]
[]
[null,null,"ELEMES VEZÉRLŐ","NODE100VALVEB","HUNTER","NODE-100, 1 zónás, elemes vezérlő + PGV 100 BB, 9V",{"$f":"VLOOKUP(D72,' '!$1:$1048576,3,0)","v":35505},null,"db",1,null,{"$f":"G72*H72","v":0}]
[null,null,"ELEMES VEZÉRLŐ","NODE100LS","HUNTER","NODE-100 elemes vezérlő, 1 zónás, 9V",{"$f":"VLOOKUP(D73,' '!$1:$1048576,3,0)","v":25584},null,"db",1,null,{"$f":"G73*H73","v":0}]
[null,null,"ELEMES VEZÉRLŐ","NODE200","HUNTER","NODE-200 elemes vezérlő, 2 zónás, 9V",{"$f":"VLOOKUP(D74,' '!$1:$1048576,3,0)","v":42320},null,"db",1,null,{"$f":"G74*H74","v":0}]
[null,null,"ELEMES VEZÉRLŐ","NODE400","HUNTER","NODE-400 elemes vezérlő, 4 zónás, 9V",{"$f":"VLOOKUP(D75,' '!$1:$1048576,3,0)","v":49916},null,"db",1,null,{"$f":"G75*H75","v":0}]
[null,null,"ELEMES VEZÉRLŐ","NODE600","HUNTER","NODE-600 elemes vezérlő, 6 zónás, 9V",{"$f":"VLOOKUP(D76,' '!$1:$1048576,3,0)","v":58313},null,"db",1,null,{"$f":"G76*H76","v":0}]
[]
["ÚJ",null,"ELEMES VEZÉRLŐ","WPXDVKIT","RAIN BIRD","WPX-DV kit, elemes vezérlő + DV BB 1\" szelep, 1 zóna, 9V",{"$f":"VLOOKUP(D78,' '!$1:$1048576,3,0)","v":27931},null,"db",1,null,{"$f":"G78*H78","v":0}]
["ÚJ",null,"ELEMES VEZÉRLŐ","WPX1","RAIN BIRD","WPX1 elemes vezérlő, 1 zónás, 9V",{"$f":"VLOOKUP(D79,' '!$1:$1048576,3,0)","v":25160},null,"db",1,null,0]
["ÚJ",null,"ELEMES VEZÉRLŐ","WPX2","RAIN BIRD","WPX2 elemes vezérlő, 2 zónás, 9V",{"$f":"VLOOKUP(D80,' '!$1:$1048576,3,0)","v":43399},null,"db",1,null,0]
{"$rows_left_out":1557}
{"sheet":" ","index":1,"n_rows":1945,"n_cols":4,"rows_kept":1945,"cut":false,"hidden":true,"merged":[]}
["Azonosító","Cikk megnevezése","1.nettó ár"]
["10-HE VAN","10 HE VAN áll. fúvóka Rain Bird, (R=3.0m; 0-360°)",625,{"$f":"IF(#REF!=A2, \"Egyezik\", \"Nem egyezik\")","v":{"$error":"#REF!"}}]
["10-VAN","10 VAN áll. fúvóka Rain Bird, (R=3.0m; 0-360°)",570,{"$f":"IF(#REF!=A3, \"Egyezik\", \"Nem egyezik\")","v":{"$error":"#REF!"}}]
["H 10A","10'A áll. fúvóka Hunter, (R=3.0m; 0-360°)",530,{"$f":"IF(#REF!=A4, \"Egyezik\", \"Nem egyezik\")","v":{"$error":"#REF!"}}]
["H10F","10'F fúvóka Hunter, (R=3.0m; 360°)",530,{"$f":"IF(#REF!=A5, \"Egyezik\", \"Nem egyezik\")","v":{"$error":"#REF!"}}]
["R10-F","10'F fúvóka Rain Bird",600,{"$f":"IF(#REF!=A6, \"Egyezik\", \"Nem egyezik\")","v":{"$error":"#REF!"}}]
["89-1437","10-F-PC fúvóka Toro",598,{"$f":"IF(#REF!=A7, \"Egyezik\", \"Nem egyezik\")","v":{"$error":"#REF!"}}]
["H 10H","10'H fúvóka Hunter, (R=3.0m; 180°)",530,{"$f":"IF(#REF!=A8, \"Egyezik\", \"Nem egyezik\")","v":{"$error":"#REF!"}}]
["R10-H","10'H fúvóka Rain Bird",600,{"$f":"IF(#REF!=A9, \"Egyezik\", \"Nem egyezik\")","v":{"$error":"#REF!"}}]
["O-T-10-HP","10-H Pecision fúvóka Toro",1624,{"$f":"IF(#REF!=A10, \"Egyezik\", \"Nem egyezik\")","v":{"$error":"#REF!"}}]
["89-1446","10-H-PC fúvóka Toro",598,{"$f":"IF(#REF!=A11, \"Egyezik\", \"Nem egyezik\")","v":{"$error":"#REF!"}}]
["H-10-Q","10'Q fúvóka Hunter, (R=3.0m; 90°)",530,{"$f":"IF(#REF!=A12, \"Egyezik\", \"Nem egyezik\")","v":{"$error":"#REF!"}}]
["R10-Q","10'Q fúvóka Rain Bird",600,{"$f":"IF(#REF!=A13, \"Egyezik\", \"Nem egyezik\")","v":{"$error":"#REF!"}}]
["89-1452","10-Q-PC fúvóka Toro",598,{"$f":"IF(#REF!=A14, \"Egyezik\", \"Nem egyezik\")","v":{"$error":"#REF!"}}]
["89-1519","10-SSF-PC fúvóka Toro",598,{"$f":"IF(#REF!=A15, \"Egyezik\", \"Nem egyezik\")","v":{"$error":"#REF!"}}]
["89-1521","10-SSH-PC fúvóka Toro",598,{"$f":"IF(#REF!=A16, \"Egyezik\", \"Nem egyezik\")","v":{"$error":"#REF!"}}]
["89-1547","10-SSQ-PC fúvóka Toro",598,{"$f":"IF(#REF!=A17, \"Egyezik\", \"Nem egyezik\")","v":{"$error":"#REF!"}}]
["R10-T","10'T fúvóka Rain Bird",600,{"$f":"IF(#REF!=A18, \"Egyezik\", \"Nem egyezik\")","v":{"$error":"#REF!"}}]
["89-1449","10-T-PC fúvóka Toro",598,{"$f":"IF(#REF!=A19, \"Egyezik\", \"Nem egyezik\")","v":{"$error":"#REF!"}}]
["O-T-10-TQP","10-TQ Pecision fúvóka Toro",1624,{"$f":"IF(#REF!=A20, \"Egyezik\", \"Nem egyezik\")","v":{"$error":"#REF!"}}]
["89-1440","10-TQ-PC fúvóka Toro",598,{"$f":"IF(#REF!=A21, \"Egyezik\", \"Nem egyezik\")","v":{"$error":"#REF!"}}]
["89-1443","10-TT-PC fúvóka Toro",598,{"$f":"IF(#REF!=A22, \"Egyezik\", \"Nem egyezik\")","v":{"$error":"#REF!"}}]
["10-TVAN","10-TVAN, KVAN áll. fúvóka Toro",670,{"$f":"IF(#REF!=A23, \"Egyezik\", \"Nem egyezik\")","v":{"$error":"#REF!"}}]
["12-HE VAN","12 HE VAN áll. fúvóka Rain Bird, (R=3.6m; 0-360°)",625,{"$f":"IF(#REF!=A24, \"Egyezik\", \"Nem egyezik\")","v":{"$error":"#REF!"}}]
["12-VAN","12 VAN áll. fúvóka Rain Bird, (R=3.6m; 0-360°)",570,{"$f":"IF(#REF!=A25, \"Egyezik\", \"Nem egyezik\")","v":{"$error":"#REF!"}}]
["H 12A","12'A áll. fúvóka Hunter, (R=3.6m; 0-360°)",530,{"$f":"IF(#REF!=A26, \"Egyezik\", \"Nem egyezik\")","v":{"$error":"#REF!"}}]
["H12F","12'F fúvóka Hunter, (R=3.6m; 360°)",530,{"$f":"IF(#REF!=A27, \"Egyezik\", \"Nem egyezik\")","v":{"$error":"#REF!"}}]
["R12-F","12'F fúvóka Rain Bird",600,{"$f":"IF(#REF!=A28, \"Egyezik\", \"Nem egyezik\")","v":{"$error":"#REF!"}}]
["O-T-12-FP","12-F Pecision fúvóka Toro",1624,{"$f":"IF(#REF!=A29, \"Egyezik\", \"Nem egyezik\")","v":{"$error":"#REF!"}}]
["89-1419","12-F-PC fúvóka Toro",598,{"$f":"IF(#REF!=A30, \"Egyezik\", \"Nem egyezik\")","v":{"$error":"#REF!"}}]
["H 12H","12'H fúvóka Hunter, (R=3.6m; 180°)",530,{"$f":"IF(#REF!=A31, \"Egyezik\", \"Nem egyezik\")","v":{"$error":"#REF!"}}]
["R12-H","12'H fúvóka Rain Bird",600,{"$f":"IF(#REF!=A32, \"Egyezik\", \"Nem egyezik\")","v":{"$error":"#REF!"}}]
["O-T-12-HP","12-H Pecision fúvóka Toro",1624,{"$f":"IF(#REF!=A33, \"Egyezik\", \"Nem egyezik\")","v":{"$error":"#REF!"}}]
["89-1428","12-H-PC fúvóka Toro",598,{"$f":"IF(#REF!=A34, \"Egyezik\", \"Nem egyezik\")","v":{"$error":"#REF!"}}]
["H 12Q","12'Q fúvóka Hunter, (R=3.6m; 90°)",530,{"$f":"IF(#REF!=A35, \"Egyezik\", \"Nem egyezik\")","v":{"$error":"#REF!"}}]
["R12-Q","12'Q fúvóka Rain Bird",600,{"$f":"IF(#REF!=A36, \"Egyezik\", \"Nem egyezik\")","v":{"$error":"#REF!"}}]
["O-T-12-QP","12-Q Pecision fúvóka Toro",1624,{"$f":"IF(#REF!=A37, \"Egyezik\", \"Nem egyezik\")","v":{"$error":"#REF!"}}]
["89-1434","12-Q-PC fúvóka Toro",598,{"$f":"IF(#REF!=A38, \"Egyezik\", \"Nem egyezik\")","v":{"$error":"#REF!"}}]
["R12-T","12'T fúvóka Rain Bird",600,{"$f":"IF(#REF!=A39, \"Egyezik\", \"Nem egyezik\")","v":{"$error":"#REF!"}}]
["89-1431","12-T-PC fúvóka Toro",598,{"$f":"IF(#REF!=A40, \"Egyezik\", \"Nem egyezik\")","v":{"$error":"#REF!"}}]
["R12/TQ","12'TQ fúvóka Rain Bird",600,{"$f":"IF(#REF!=A41, \"Egyezik\", \"Nem egyezik\")","v":{"$error":"#REF!"}}]
["89-1422","12-TQ-PC fúvóka Toro",598,{"$f":"IF(#REF!=A42, \"Egyezik\", \"Nem egyezik\")","v":{"$error":"#REF!"}}]
["R12-TT","12'TT fúvóka Rain Bird",600,{"$f":"IF(#REF!=A43, \"Egyezik\", \"Nem egyezik\")","v":{"$error":"#REF!"}}]
["O-T-12-TTP","12-TT Pecision fúvóka Toro",1624,{"$f":"IF(#REF!=A44, \"Egyezik\", \"Nem egyezik\")","v":{"$error":"#REF!"}}]
["89-1425","12-TT-PC fúvóka Toro",598,{"$f":"IF(#REF!=A45, \"Egyezik\", \"Nem egyezik\")","v":{"$error":"#REF!"}}]
["12-TVAN","12-TVAN, KVAN áll. fúvóka Toro",670,{"$f":"IF(#REF!=A46, \"Egyezik\", \"Nem egyezik\")","v":{"$error":"#REF!"}}]
["R1401","1401 Bubbler fúvóka 1/2\" BM",1966,{"$f":"IF(#REF!=A47, \"Egyezik\", \"Nem egyezik\")","v":{"$error":"#REF!"}}]
["15-HE VAN","15 HE VAN áll. fúvóka Rain Bird, (R=4.5m; 0-360°)",625,{"$f":"IF(#REF!=A48, \"Egyezik\", \"Nem egyezik\")","v":{"$error":"#REF!"}}]
["15-VAN","15 VAN áll. fúvóka Rain Bird, (R=4.5m; 0-360°)",570,{"$f":"IF(#REF!=A49, \"Egyezik\", \"Nem egyezik\")","v":{"$error":"#REF!"}}]
["H 15A","15'A áll. fúvóka Hunter, (R=4.5m; 0-360°)",530,{"$f":"IF(#REF!=A50, \"Egyezik\", \"Nem egyezik\")","v":{"$error":"#REF!"}}]
["R15-CST","15'CST fúvóka Rain Bird",600,{"$f":"IF(#REF!=A51, \"Egyezik\", \"Nem egyezik\")","v":{"$error":"#REF!"}}]
["R15-EST","15'EST fúvóka Rain Bird",600,{"$f":"IF(#REF!=A52, \"Egyezik\", \"Nem egyezik\")","v":{"$error":"#REF!"}}]
["H 15F","15'F fúvóka Hunter, (R=4.5m; 360°)",530,{"$f":"IF(#REF!=A53, \"Egyezik\", \"Nem egyezik\")","v":{"$error":"#REF!"}}]
["R15-F","15'F fúvóka Rain Bird",600,{"$f":"IF(#REF!=A54, \"Egyezik\", \"Nem egyezik\")","v":{"$error":"#REF!"}}]
["89-1401","15-F-PC fúvóka Toro",598,{"$f":"IF(#REF!=A55, \"Egyezik\", \"Nem egyezik\")","v":{"$error":"#REF!"}}]
["H 15H","15'H fúvóka Hunter, (R=4.5m; 180°)",530,{"$f":"IF(#REF!=A56, \"Egyezik\", \"Nem egyezik\")","v":{"$error":"#REF!"}}]
["R15-H","15'H fúvóka Rain Bird",600,{"$f":"IF(#REF!=A57, \"Egyezik\", \"Nem egyezik\")","v":{"$error":"#REF!"}}]
["O-T-15-HP","15-H Pecision fúvóka Toro",1624,{"$f":"IF(#REF!=A58, \"Egyezik\", \"Nem egyezik\")","v":{"$error":"#REF!"}}]
["K-15HL","15-HL fúvóka Toro",598,{"$f":"IF(#REF!=A59, \"Egyezik\", \"Nem egyezik\")","v":{"$error":"#REF!"}}]
["89-1410","15-H-PC fúvóka Toro",598,{"$f":"IF(#REF!=A60, \"Egyezik\", \"Nem egyezik\")","v":{"$error":"#REF!"}}]
["R15-LCS","15'LCS fúvóka Rain Bird",600,{"$f":"IF(#REF!=A61, \"Egyezik\", \"Nem egyezik\")","v":{"$error":"#REF!"}}]
["H 15Q","15'Q fúvóka Hunter, (R=4.5m; 90°)",530,{"$f":"IF(#REF!=A62, \"Egyezik\", \"Nem egyezik\")","v":{"$error":"#REF!"}}]
["R15-Q","15'Q fúvóka Rain Bird",600,{"$f":"IF(#REF!=A63, \"Egyezik\", \"Nem egyezik\")","v":{"$error":"#REF!"}}]
["O-T-15-QP","15-Q Pecision fúvóka Toro",1624,{"$f":"IF(#REF!=A64, \"Egyezik\", \"Nem egyezik\")","v":{"$error":"#REF!"}}]
["89-1416","15-Q-PC fúvóka Toro",598,{"$f":"IF(#REF!=A65, \"Egyezik\", \"Nem egyezik\")","v":{"$error":"#REF!"}}]
["R15-RCS","15'RCS fúvóka Rain Bird",600,{"$f":"IF(#REF!=A66, \"Egyezik\", \"Nem egyezik\")","v":{"$error":"#REF!"}}]
["RB-15SQ","15'SQ-fúvóka Rain Bird",600,{"$f":"IF(#REF!=A67, \"Egyezik\", \"Nem egyezik\")","v":{"$error":"#REF!"}}]
["R15-SST","15'SST fúvóka Rain Bird",600,{"$f":"IF(#REF!=A68, \"Egyezik\", \"Nem egyezik\")","v":{"$error":"#REF!"}}]
["R15/T","15'T fúvóka RainBird",600,{"$f":"IF(#REF!=A69, \"Egyezik\", \"Nem egyezik\")","v":{"$error":"#REF!"}}]
["O-T-15-TP","15-T Pecision fúvóka Toro",1624,{"$f":"IF(#REF!=A70, \"Egyezik\", \"Nem egyezik\")","v":{"$error":"#REF!"}}]
["89-1413","15-T-PC fúvóka Toro",598,{"$f":"IF(#REF!=A71, \"Egyezik\", \"Nem egyezik\")","v":{"$error":"#REF!"}}]
["R15/TQ","15'TQ fúvóka RainBird",600,{"$f":"IF(#REF!=A72, \"Egyezik\", \"Nem egyezik\")","v":{"$error":"#REF!"}}]
["89-1404","15-TQ-PC fúvóka Toro",598,{"$f":"IF(#REF!=A73, \"Egyezik\", \"Nem egyezik\")","v":{"$error":"#REF!"}}]
["R15-TT","15'TT fúvóka Rain Bird",600,{"$f":"IF(#REF!=A74, \"Egyezik\", \"Nem egyezik\")","v":{"$error":"#REF!"}}]
["89-1407","15-TT-PC fúvóka Toro",598,{"$f":"IF(#REF!=A75, \"Egyezik\", \"Nem egyezik\")","v":{"$error":"#REF!"}}]
["15-TVAN","15-TVAN, KVAN áll. fúvóka Toro",670,{"$f":"IF(#REF!=A76, \"Egyezik\", \"Nem egyezik\")","v":{"$error":"#REF!"}}]
["89-7418","15-V áll. fúvóka Toro",598,{"$f":"IF(#REF!=A77, \"Egyezik\", \"Nem egyezik\")","v":{"$error":"#REF!"}}]
["R16-F-SLA","16F SLA fúvóka Rain Bird",600,{"$f":"IF(#REF!=A78, \"Egyezik\", \"Nem egyezik\")","v":{"$error":"#REF!"}}]
["R16H-SLA","16H SLA fúvóka Rain Bird",600,{"$f":"IF(#REF!=A79, \"Egyezik\", \"Nem egyezik\")","v":{"$error":"#REF!"}}]
["R16Q-SLA","16Q SLA fúvóka Rain Bird",600,{"$f":"IF(#REF!=A80, \"Egyezik\", \"Nem egyezik\")","v":{"$error":"#REF!"}}]
{"$rows_left_out":1865}